{"text_format":"3","workbook":"xlsx","n_sheets":3,"sheets":["本科生国奖、国励志","硕士研究生国奖","博士研究生国奖"],"not_rendered":{"external_links":1},"read":"whole","date_system":"1900"}

{"sheet":"本科生国奖、国励志","index":0,"n_rows":59,"n_cols":6,"rows_kept":59,"merged":[[0,0,0,5]]}
["人工智能学院2025年本科生国家奖学金、国家励志奖学金获奖学生名单"]
["序号","学院","学号","姓名","申请奖学金金额","申请奖学金全称"]
[1,"人工智能学院","2022011561","李根多",10000,"国家奖学金"]
[2,"人工智能学院","2022011566","陈昱灼",10000,"国家奖学金"]
[3,"人工智能学院",2022011654,"白舟",10000,"国家奖学金"]
[4,"人工智能学院",2022011336,"李振",10000,"国家奖学金"]
[5,"人工智能学院",2022011682,"徐俊飞",10000,"国家奖学金"]
[6,"人工智能学院",2022011626,"谢浩",10000,"国家奖学金"]
[7,"人工智能学院",2022012259,"李昆熹",10000,"国家奖学金"]
[8,"人工智能学院",2023011553,"冯书琴",10000,"国家奖学金"]
[9,"人工智能学院",2023011615,"侯梦蕊",10000,"国家奖学金"]
[10,"人工智能学院",2023012324,"张驰誉",10000,"国家奖学金"]
[11,"人工智能学院",2023011703,"夏雨",10000,"国家奖学金"]
[12,"人工智能学院","2023011764","陈芝胜",10000,"国家奖学金"]
[13,"人工智能学院","2023011759","刘博学",10000,"国家奖学金"]
[14,"人工智能学院","2023011372","代礼扬",10000,"国家奖学金"]
[15,"人工智能学院",2024011641,"孙子尧",10000,"国家奖学金"]
[16,"人工智能学院",2024011580,"李泽洋",10000,"国家奖学金"]
[17,"人工智能学院",2024011541,"王炜绚",10000,"国家奖学金"]
[18,"人工智能学院",2024011700,"张燕蕾",10000,"国家奖学金"]
[19,"人工智能学院",2024011772,"彭馨怡",10000,"国家奖学金"]
[20,"人工智能学院",2024011668,"陈优雅",10000,"国家奖学金"]
[21,"人工智能学院","2022012245","李蓉蓉",6000,"国家励志奖学金"]
[22,"人工智能学院","2022011537","李昊",6000,"国家励志奖学金"]
[23,"人工智能学院","2022011179","赵宇",6000,"国家励志奖学金"]
[24,"人工智能学院","2022011500","张京生",6000,"国家励志奖学金"]
[25,"人工智能学院","2022011588","张思为",6000,"国家励志奖学金"]
[26,"人工智能学院","2022011073","徐炜",6000,"国家励志奖学金"]
[27,"人工智能学院",2022011183,"缪云楚",6000,"国家励志奖学金"]
[28,"人工智能学院",2022011678,"王紫藤",6000,"国家励志奖学金"]
[29,"人工智能学院",2022011101,"田川",6000,"国家励志奖学金"]
[30,"人工智能学院",2022010804,"宋子杭",6000,"国家励志奖学金"]
[31,"人工智能学院",2022011623,"李浩然 ",6000,"国家励志奖学金"]
[32,"人工智能学院",2022010710,"肖珂",6000,"国家励志奖学金"]
[33,"人工智能学院",2022010065,"周蕊",6000,"国家励志奖学金"]
[34,"人工智能学院",2023011980,"李宁",6000,"国家励志奖学金"]
[35,"人工智能学院",2023011588,"段盈君",6000,"国家励志奖学金"]
[36,"人工智能学院","2023011978","曹露",6000,"国家励志奖学金"]
[37,"人工智能学院",2023011591,"宋献蕊",6000,"国家励志奖学金"]
[38,"人工智能学院",2023011620,"杨晓蝶",6000,"国家励志奖学金"]
[39,"人工智能学院","2023010061","张礼健",6000,"国家励志奖学金"]
[40,"人工智能学院",2023011679,"蔡宜含",6000,"国家励志奖学金"]
[41,"人工智能学院",2023011664,"付明俊",6000,"国家励志奖学金"]
[42,"人工智能学院",2023011657,"刘一坤",6000,"国家励志奖学金"]
[43,"人工智能学院",2023011753,"霍嘉宇",6000,"国家励志奖学金"]
[44,"人工智能学院",2023011760,"霍智勋",6000,"国家励志奖学金"]
[45,"人工智能学院",2023011748,"安琪",6000,"国家励志奖学金"]
[46,"人工智能学院",2023011585,"马美越",6000,"国家励志奖学金"]
[47,"人工智能学院",2023011709,"李宇彤",6000,"国家励志奖学金"]
[48,"人工智能学院",2024011599,"邢毓佳",6000,"国家励志奖学金"]
[49,"人工智能学院",2024011548,"刘闯",6000,"国家励志奖学金"]
[50,"人工智能学院",2024011768,"唐毅",6000,"国家励志奖学金"]
[51,"人工智能学院","2024011766","韩冰月",6000,"国家励志奖学金"]
[52,"人工智能学院",2024011552,"冯浩晖",6000,"国家励志奖学金"]
[53,"人工智能学院",2024011690,"徐恺",6000,"国家励志奖学金"]
[54,"人工智能学院",2024011748,"陈润强",6000,"国家励志奖学金"]
[55,"人工智能学院",2024011752,"李以昂",6000,"国家励志奖学金"]
[56,"人工智能学院",2024011712,"唐文浩",6000,"国家励志奖学金"]
[57,"人工智能学院",2024011698,"李培权",6000,"国家励志奖学金"]

{"sheet":"硕士研究生国奖","index":1,"n_rows":15,"n_cols":8,"rows_kept":15,"merged":[[0,0,0,5]]}
["人工智能学院2025年硕士研究生国家奖学金获奖学生名单"]
["序号","学院","学号","姓名","申请奖学金金额","申请奖学金全称",null,"张江洪"]
[1,"人工智能学院",{"$f":"VLOOKUP(H2,[1]花名册总表!$D:$E,2,FALSE)","v":2023211205},"张江洪",20000,"国家奖学金",null,"陈鹏"]
[2,"人工智能学院",{"$f":"VLOOKUP(H3,[1]花名册总表!$D:$E,2,FALSE)","v":2023211214},"陈鹏",20000,"国家奖学金",null,"卞蕊"]
[3,"人工智能学院",{"$f":"VLOOKUP(H4,[1]花名册总表!$D:$E,2,FALSE)","v":2023211242},"卞蕊",20000,"国家奖学金",null,"刘永健"]
[4,"人工智能学院",{"$f":"VLOOKUP(H5,[1]花名册总表!$D:$E,2,FALSE)","v":2023211247},"刘永健",20000,"国家奖学金",null,"刘志强"]
[5,"人工智能学院",{"$f":"VLOOKUP(H6,[1]花名册总表!$D:$E,2,FALSE)","v":2023211273},"刘志强",20000,"国家奖学金",null,"李晓雪"]
[6,"人工智能学院",{"$f":"VLOOKUP(H7,[1]花名册总表!$D:$E,2,FALSE)","v":2023211272},"李晓雪",20000,"国家奖学金",null,"张若谷"]
[7,"人工智能学院",{"$f":"VLOOKUP(H8,[1]花名册总表!$D:$E,2,FALSE)","v":2023216001},"张若谷",20000,"国家奖学金",null,"张毅龙"]
[8,"人工智能学院",{"$f":"VLOOKUP(H9,[1]花名册总表!$D:$E,2,FALSE)","v":2023216068},"张毅龙",20000,"国家奖学金",null,"郭倩"]
[9,"人工智能学院",{"$f":"VLOOKUP(H10,[1]花名册总表!$D:$E,2,FALSE)","v":2023216048},"郭倩",20000,"国家奖学金",null,"夏苏勇"]
[10,"人工智能学院",{"$f":"VLOOKUP(H11,[1]花名册总表!$D:$E,2,FALSE)","v":2023216059},"夏苏勇",20000,"国家奖学金",null,"陈潞梦"]
[11,"人工智能学院",{"$f":"VLOOKUP(H12,[1]花名册总表!$D:$E,2,FALSE)","v":2023216035},"陈潞梦",20000,"国家奖学金",null,"熊宇"]
[12,"人工智能学院",{"$f":"VLOOKUP(H13,[1]花名册总表!$D:$E,2,FALSE)","v":2023216043},"熊宇",20000,"国家奖学金",null,"卢春昊"]
[13,"人工智能学院",{"$f":"VLOOKUP(H14,[1]花名册总表!$D:$E,2,FALSE)","v":2023216516},"卢春昊",20000,"国家奖学金"]

{"sheet":"博士研究生国奖","index":2,"n_rows":6,"n_cols":6,"rows_kept":6,"merged":[[0,0,0,5]]}
["人工智能学院2025年博士研究生国家奖学金获奖学生名单"]
["序号","学院","学号","姓名","申请奖学金金额","申请奖学金全称"]
[1,"人工智能学院",2023310703,"吴世伟",30000,"国家奖学金"]
[2,"人工智能学院",2023311103,"周德涛",30000,"国家奖学金"]
[3,"人工智能学院",2023316102,"沐华艳",30000,"国家奖学金"]
[4,"人工智能学院",2023310711,"王赫萌",30000,"国家奖学金"]